Reaction Details
TargetMitogen-activated protein kinase kinase kinase kinase 4
LigandBDBM50011554
Substrate/Competitorn/a
Meas. Tech.Inhibition Assay
IC50 1200±n/a nM
Citation Chen, HCrawford, THarris, SFMagnuson, SRNbdubaku, CWang, L Aminoquinazoline and pyridopyrimidine derivatives US Patent US9855269 Publication Date 1/2/2018
 
Mitogen-activated protein kinase kinase kinase kinase 4
Name:Mitogen-activated protein kinase kinase kinase kinase 4
Type:Serine/threonine-protein kinase
Mol. Mass.:142114.73
Organism:Homo sapiens (Human)
Description:O95819
Residue:1239
BDBM50011554
NameBDBM50011554
Synonyms:CHEMBL3262573 US9855269, Compound 9
TypeSmall organic molecule
Emp. Form.C15H13N3O
Mol. Mass.251.2832
SMILESCOc1ccc(cc1)-c1ccc2ncnc(N)c2c1