Reaction Details
TargetMitogen-activated protein kinase kinase kinase kinase 4
LigandBDBM50011560
Substrate/Competitorn/a
Meas. Tech.Inhibition Assay
IC50 84.0±n/a nM
Citation Chen, HCrawford, THarris, SFMagnuson, SRNbdubaku, CWang, L Aminoquinazoline and pyridopyrimidine derivatives US Patent US9855269 Publication Date 1/2/2018
 
Mitogen-activated protein kinase kinase kinase kinase 4
Name:Mitogen-activated protein kinase kinase kinase kinase 4
Type:Serine/threonine-protein kinase
Mol. Mass.:142114.73
Organism:Homo sapiens (Human)
Description:O95819
Residue:1239
BDBM50011560
NameBDBM50011560
Synonyms:CHEMBL3262579 US9855269, Compound 31
TypeSmall organic molecule
Emp. Form.C14H11FN4
Mol. Mass.254.2623
SMILESNc1cc(F)cc(c1)-c1ccc2ncnc(N)c2c1