Reaction Details
TargetMitogen-activated protein kinase kinase kinase kinase 4
LigandBDBM299492
Substrate/Competitorn/a
Meas. Tech.Inhibition Assay
IC50 14.7±n/a nM
Citation Chen, HCrawford, THarris, SFMagnuson, SRNbdubaku, CWang, L Aminoquinazoline and pyridopyrimidine derivatives US Patent US9855269 Publication Date 1/2/2018
 
Mitogen-activated protein kinase kinase kinase kinase 4
Name:Mitogen-activated protein kinase kinase kinase kinase 4
Type:Serine/threonine-protein kinase
Mol. Mass.:142114.73
Organism:Homo sapiens (Human)
Description:O95819
Residue:1239
BDBM299492
NameBDBM299492
Synonyms:2-(4-amino- quinazolin- 6-yl)phenyl US9855269, Compound 112
TypeSmall organic molecule
Emp. Form.C14H11N3O
Mol. Mass.237.2566
SMILESNc1ncnc2ccc(cc12)-c1cccc(O)c1