Reaction Details
TargetMitogen-activated protein kinase kinase kinase kinase 4
LigandBDBM299563
Substrate/Competitorn/a
Meas. Tech.Inhibition Assay
IC50 253±n/a nM
Citation Chen, HCrawford, THarris, SFMagnuson, SRNbdubaku, CWang, L Aminoquinazoline and pyridopyrimidine derivatives US Patent US9855269 Publication Date 1/2/2018
 
Mitogen-activated protein kinase kinase kinase kinase 4
Name:Mitogen-activated protein kinase kinase kinase kinase 4
Type:Serine/threonine-protein kinase
Mol. Mass.:142114.73
Organism:Homo sapiens (Human)
Description:O95819
Residue:1239
BDBM299563
NameBDBM299563
Synonyms:N6-[(2-fluoro- phenyl)methyl] pyrido[3,2-d] pyrimidine-4,6- diamine US9855269, Compound 230
TypeSmall organic molecule
Emp. Form.C14H12FN5
Mol. Mass.269.277
SMILESNc1ncnc2ccc(NCc3ccccc3F)nc12