Reaction Details
TargetMitogen-activated protein kinase kinase kinase kinase 4
LigandBDBM364098
Substrate/Competitorn/a
Meas. Tech.Inhibition Assay
IC50 10.1±n/a nM
Citation Chen, HCrawford, THarris, SFMagnuson, SRNbdubaku, CWang, L Aminoquinazoline and pyridopyrimidine derivatives US Patent US9855269 Publication Date 1/2/2018
 
Mitogen-activated protein kinase kinase kinase kinase 4
Name:Mitogen-activated protein kinase kinase kinase kinase 4
Type:Serine/threonine-protein kinase
Mol. Mass.:142114.73
Organism:Homo sapiens (Human)
Description:O95819
Residue:1239
BDBM364098
NameBDBM364098
Synonyms:6-[3-fluoro-5-(4-methyl-1H-pyrazol-3-yl)phenyl]pyrido[3,2-d]pyrimidin-4-amine | US9855269, Compound 341
TypeSmall organic molecule
Emp. Form.C17H13FN6
Mol. Mass.320.3237
SMILESCc1c[nH]nc1-c1cc(F)cc(c1)-c1ccc2ncnc(N)c2n1