Reaction Details
TargetEstrogen receptor
LigandBDBM19976
Substrate/Competitor17beta-estradiol (E2)
Meas. Tech.Estrogen Receptor Binding Assay.
pH7.5±n/a
Temperature295.15±n/a K
Ki 40±27 nM
Citation Richardson, TINorman, BHLugar, CWJones, SAWang, YDurbin, JDKrishnan, VDodge, JA Benzopyrans as selective estrogen receptor beta agonists (SERBAs). Part 2: structure-activity relationship studies on the benzopyran scaffold. Bioorg Med Chem Lett17:3570-4 (2007) 
 
Estrogen receptor
Name:Estrogen receptor
Type:Protein
Mol. Mass.:66230.44
Organism:Homo sapiens (Human)
Description:P03372
Residue:595
BDBM19976
17beta-estradiol (E2)
NameBDBM19976
Synonyms:4-[(2R,6S,7R)-8-oxatricyclo[7.4.0.0^{2,6}]trideca-1(9),10,12-trien-7-yl]phenol racemic mixture
TypeSmall organic molecule
Emp. Form.C18H18O2
Mol. Mass.266.3343
SMILESOc1ccc(cc1)[C@@H]1Oc2ccccc2[C@@H]2CCC[C@H]12