Reaction Details
TargetEstrogen receptor
LigandBDBM19980
Substrate/Competitor17beta-estradiol (E2)
Meas. Tech.Estrogen Receptor Binding Assay.
pH7.5±n/a
Temperature295.15±n/a K
Ki>1000±n/a nM
Citation Richardson, TIDodge, JADurst, GLPfeifer, LAShah, JWang, YDurbin, JDKrishnan, VNorman, BH Benzopyrans as selective estrogen receptor beta agonists (SERBAs). Part 3: synthesis of cyclopentanone and cyclohexanone intermediates for C-ring modification. Bioorg Med Chem Lett17:4824-8 (2007) 
 
Estrogen receptor
Name:Estrogen receptor
Type:Protein
Mol. Mass.:66230.44
Organism:Homo sapiens (Human)
Description:P03372
Residue:595
BDBM19980
17beta-estradiol (E2)
NameBDBM19980
Synonyms:(1S,9S,10R)-4-hydroxy-9-(4-hydroxyphenyl)-8-oxatricyclo[8.4.0.0^{2,7}]tetradeca-2(7),3,5-trien-13-one racemic mixture
TypeSmall organic molecule
Emp. Form.C19H18O4
Mol. Mass.310.3438
SMILESOc1ccc(cc1)[C@H]1Oc2ccc(O)cc2[C@H]2CC(=O)CC[C@@H]12