Reaction Details
TargetEstrogen receptor
LigandBDBM19983
Substrate/Competitor17beta-estradiol (E2)
Meas. Tech.Estrogen Receptor Binding Assay.
pH7.5±n/a
Temperature295.15±n/a K
Ki 7.2±0.8 nM
Citation Richardson, TIDodge, JADurst, GLPfeifer, LAShah, JWang, YDurbin, JDKrishnan, VNorman, BH Benzopyrans as selective estrogen receptor beta agonists (SERBAs). Part 3: synthesis of cyclopentanone and cyclohexanone intermediates for C-ring modification. Bioorg Med Chem Lett17:4824-8 (2007) 
 
Estrogen receptor
Name:Estrogen receptor
Type:Protein
Mol. Mass.:66230.44
Organism:Homo sapiens (Human)
Description:P03372
Residue:595
BDBM19983
17beta-estradiol (E2)
NameBDBM19983
Synonyms:(2R,4R,6S,7R)-7-(4-hydroxyphenyl)-4-(trifluoromethyl)-8-oxatricyclo[7.4.0.0^{2,6}]trideca-1(9),10,12-trien-12-ol | C-ring modified benzopyran scaffold, 2c
TypeSmall organic molecule
Emp. Form.C19H17F3O3
Mol. Mass.350.3317
SMILES[H][C@@]1(C[C@H]2[C@@H](C1)c1cc(O)ccc1O[C@H]2c1ccc(O)cc1)C(F)(F)F