Reaction Details
TargetEstrogen receptor
LigandBDBM19968
Substrate/Competitor17beta-estradiol (E2)
Meas. Tech.Estrogen Receptor Binding Assay.
pH7.5±n/a
Temperature295.15±n/a K
Ki 2.29±1.52 nM
Citation Norman, BHRichardson, TIDodge, JAPfeifer, LADurst, GLWang, YDurbin, JDKrishnan, VDinn, SRLiu, SReilly, JERyter, KT Benzopyrans as selective estrogen receptor beta agonists (SERBAs). Part 4: functionalization of the benzopyran A-ring. Bioorg Med Chem Lett17:5082-5 (2007) 
 
Estrogen receptor
Name:Estrogen receptor
Type:Protein
Mol. Mass.:66230.44
Organism:Homo sapiens (Human)
Description:P03372
Residue:595
BDBM19968
17beta-estradiol (E2)
NameBDBM19968
Synonyms:(2R,6S,7R)-7-(4-hydroxyphenyl)-8-oxatricyclo[7.4.0.0^{2,6}]trideca-1(13),9,11-trien-12-ol Benzopyran derivative., 4b(racemate) racemic mixture
TypeSmall organic molecule
Emp. Form.C18H18O3
Mol. Mass.282.3337
SMILESOc1ccc(cc1)[C@@H]1Oc2ccc(O)cc2[C@@H]2CCC[C@H]12