Reaction Details
TargetEstrogen receptor
LigandBDBM19969
Substrate/Competitor17beta-estradiol (E2)
Meas. Tech.Estrogen Receptor Binding Assay.
pH7.5±n/a
Temperature295.15±n/a K
Ki 14.5±6.4 nM
Citation Richardson, TIDodge, JAWang, YDurbin, JDKrishnan, VNorman, BH Benzopyrans as selective estrogen receptor beta agonists (SERBAs). Part 5: Combined A- and C-ring structure-activity relationship studies. Bioorg Med Chem Lett17:5563-6 (2007) 
 
Estrogen receptor
Name:Estrogen receptor
Type:Protein
Mol. Mass.:66230.44
Organism:Homo sapiens (Human)
Description:P03372
Residue:595
BDBM19969
17beta-estradiol (E2)
NameBDBM19969
Synonyms:(2S,6R,7S)-7-(4-hydroxyphenyl)-8-oxatricyclo[7.4.0.0^{2,6}]trideca-1(13),9,11-trien-12-ol | SERBA-2
TypeSmall organic molecule
Emp. Form.C18H18O3
Mol. Mass.282.3337
SMILESOc1ccc(cc1)[C@H]1Oc2ccc(O)cc2[C@H]2CCC[C@@H]12