Reaction Details
TargetSodium-dependent dopamine transporter
LigandBDBM364419
Substrate/Competitorn/a
Meas. Tech.Dopamine Transporter Binding Assay
Ki 3.17±0.11 nM
Citation Newman, AHOkunola-Bakare, OMCao, J Potent and selective inhibitors of monoamine transporters; method of making; and use thereof US Patent US9862679 Publication Date 1/9/2018
 
Sodium-dependent dopamine transporter
Name:Sodium-dependent dopamine transporter
Type:Multi-pass membrane protein
Mol. Mass.:68749.45
Organism:Rattus norvegicus (rat)
Description:P23977
Residue:619
BDBM364419
NameBDBM364419
Synonyms:US10913711, Compound 8a | US9862679, Compound 8a
TypeSmall organic molecule
Emp. Form.C28H34N2OS
Mol. Mass.446.647
SMILESO=S(CCN1CCN(CCCc2ccccc2)CC1)C(c1ccccc1)c1ccccc1