Reaction Details
TargetTransient receptor potential cation channel subfamily V member 1
LigandBDBM20284
Substrate/CompetitorBDBM20285
Meas. Tech.Competition Binding Assay and Inhibition of Ca2+ Uptake Assay
pH7.4±n/a
Temperature310.15±n/a K
Ki 1300±150 nM
EC50 520±12 nM
Citation Ryu, HJin, MKKim, SYChoi, HKKang, SUKang, DWLee, JPearce, LVPavlyukovets, VAMorgan, MATran, RToth, ALundberg, DJBlumberg, PM Stereospecific high-affinity TRPV1 antagonists: chiral N-(2-Benzyl-3-pivaloyloxypropyl) 2-[4-(methylsulfonylamino)phenyl]propionamide analogues. J Med Chem51:57-67 (2008) 
 
Transient receptor potential cation channel subfamily V member 1
Name:Transient receptor potential cation channel subfamily V member 1
Type:Transient Receptor
Mol. Mass.:94956.12
Organism:Rattus norvegicus (rat)
Description:O35433
Residue:838
BDBM20284
BDBM20285
NameBDBM20284
Synonyms:CHEMBL391997 Capsazepine N-[2-(4-chlorophenyl)ethyl]-7,8-dihydroxy-2,3,4,5-tetrahydro-1H-2-benzazepine-2-carbothioamide
TypeSmall organic molecule
Emp. Form.C19H21ClN2O2S
Mol. Mass.376.9
SMILESOc1cc2CCCN(Cc2cc1O)C(=S)NCCc1ccc(Cl)cc1