Reaction Details
TargetTransient receptor potential cation channel subfamily V member 1
LigandBDBM20296
Substrate/CompetitorBDBM20285
Meas. Tech.Competition Binding Assay and Inhibition of Ca2+ Uptake Assay
pH7.4±n/a
Temperature310.15±n/a K
Ki 33.1±8.7 nM
EC50 10.8±3.6 nM
Citation Ryu, HJin, MKKim, SYChoi, HKKang, SUKang, DWLee, JPearce, LVPavlyukovets, VAMorgan, MATran, RToth, ALundberg, DJBlumberg, PM Stereospecific high-affinity TRPV1 antagonists: chiral N-(2-Benzyl-3-pivaloyloxypropyl) 2-[4-(methylsulfonylamino)phenyl]propionamide analogues. J Med Chem51:57-67 (2008) 
 
Transient receptor potential cation channel subfamily V member 1
Name:Transient receptor potential cation channel subfamily V member 1
Type:Transient Receptor
Mol. Mass.:94956.12
Organism:Rattus norvegicus (rat)
Description:O35433
Residue:838
BDBM20296
BDBM20285
NameBDBM20296
Synonyms:2-[(3,4-dimethylphenyl)methyl]-3-[2-(3-fluoro-4-methanesulfonamidophenyl)propanamido]propyl 2,2-dimethylpropanoate | alpha-methyl amide analogue, 14
TypeSmall organic molecule
Emp. Form.C27H37FN2O5S
Mol. Mass.520.656
SMILESCC(C(=O)NCC(COC(=O)C(C)(C)C)Cc1ccc(C)c(C)c1)c1ccc(NS(C)(=O)=O)c(F)c1