Reaction Details
TargetTransient receptor potential cation channel subfamily V member 1
LigandBDBM20314
Substrate/CompetitorBDBM20285
Meas. Tech.Competition Binding Assay and Inhibition of Ca2+ Uptake Assay
pH7.4±n/a
Temperature310.15±n/a K
Ki 1.83±0.5 nM
EC50 5.2±1.6 nM
Citation Ryu, HJin, MKKim, SYChoi, HKKang, SUKang, DWLee, JPearce, LVPavlyukovets, VAMorgan, MATran, RToth, ALundberg, DJBlumberg, PM Stereospecific high-affinity TRPV1 antagonists: chiral N-(2-Benzyl-3-pivaloyloxypropyl) 2-[4-(methylsulfonylamino)phenyl]propionamide analogues. J Med Chem51:57-67 (2008) 
 
Transient receptor potential cation channel subfamily V member 1
Name:Transient receptor potential cation channel subfamily V member 1
Type:Transient Receptor
Mol. Mass.:94956.12
Organism:Rattus norvegicus (rat)
Description:O35433
Residue:838
BDBM20314
BDBM20285
NameBDBM20314
Synonyms:(2R)-2-[(4-tert-butylphenyl)methyl]-3-[(2S)-2-(3-chloro-4-methanesulfonamidophenyl)propanamido]propyl 2,2-dimethylpropanoate | 4-t-butylbenzyl analogue, 73
TypeSmall organic molecule
Emp. Form.C29H41ClN2O5S
Mol. Mass.565.164
SMILESC[C@H](C(=O)NC[C@H](COC(=O)C(C)(C)C)Cc1ccc(cc1)C(C)(C)C)c1ccc(NS(C)(=O)=O)c(Cl)c1