Reaction Details
TargetMitogen-activated protein kinase kinase kinase 12
LigandBDBM365242
Substrate/Competitorn/a
Meas. Tech.TR-FRET assay
Ki 8.55±n/a nM
Citation Cohen, FPatel, S C-linked heterocycloaklyl substituted pyrimidines and their uses US Patent US9868720 Publication Date 1/16/2018
 
Mitogen-activated protein kinase kinase kinase 12
Name:Mitogen-activated protein kinase kinase kinase 12
Type:PROTEIN
Mol. Mass.:93216.56
Organism:Homo sapiens (Human)
Description:ChEMBL_1460553
Residue:859
BDBM365242
NameBDBM365242
Synonyms:(4-Chloro-pyridin-2-yl)- [2-(3,3-difluoro-pyrrolidin- 1-yl)-6-piperidin-4- yl-pyrimidin-4-yl]-amine | US9868720, No. 120
TypeSmall organic molecule
Emp. Form.C18H21ClF2N6
Mol. Mass.394.849
SMILESFC1(F)CCN(C1)c1nc(Nc2cc(Cl)ccn2)cc(n1)C1CCNCC1