Reaction Details
TargetMitogen-activated protein kinase kinase kinase 12
LigandBDBM365290
Substrate/Competitorn/a
Meas. Tech.TR-FRET assay
Ki 1.72±n/a nM
Citation Cohen, FPatel, S C-linked heterocycloaklyl substituted pyrimidines and their uses US Patent US9868720 Publication Date 1/16/2018
 
Mitogen-activated protein kinase kinase kinase 12
Name:Mitogen-activated protein kinase kinase kinase 12
Type:PROTEIN
Mol. Mass.:93216.56
Organism:Homo sapiens (Human)
Description:ChEMBL_1460553
Residue:859
BDBM365290
NameBDBM365290
Synonyms:(1-Methyl-1H-imidazol- 4-yl)-{3-[2-(2-methyl- pyrrolidin-1-yl)-6-(4- trifluoromethyl-pyridin-2- ylamino)-pyrimidin-4-yl]- pyrrolidin-1-yl}-methanone | US9868720, No. 376
TypeSmall organic molecule
Emp. Form.C24H27F3N8O
Mol. Mass.500.5194
SMILESCC1CCCN1c1nc(Nc2cc(ccn2)C(F)(F)F)cc(n1)C1CCN(C1)C(=O)c1cn(C)cn1