Reaction Details
TargetMitogen-activated protein kinase kinase kinase 12
LigandBDBM365302
Substrate/Competitorn/a
Meas. Tech.TR-FRET assay
Ki 5.21±n/a nM
Citation Cohen, FPatel, S C-linked heterocycloaklyl substituted pyrimidines and their uses US Patent US9868720 Publication Date 1/16/2018
 
Mitogen-activated protein kinase kinase kinase 12
Name:Mitogen-activated protein kinase kinase kinase 12
Type:PROTEIN
Mol. Mass.:93216.56
Organism:Homo sapiens (Human)
Description:ChEMBL_1460553
Residue:859
BDBM365302
NameBDBM365302
Synonyms:US9868720, No. 423 | {2-(1-Methyl-1H-pyrazol- 4-yl)-6-[1-(tetrahydro- pyran-4-ylmethyl)-pyrrolidin- 3-yl]-pyrimidin-4- yl}-(4-trifluoromethyl- pyridin-2-yl)-amine
TypeSmall organic molecule
Emp. Form.C24H28F3N7O
Mol. Mass.487.5206
SMILESCn1cc(cn1)-c1nc(Nc2cc(ccn2)C(F)(F)F)cc(n1)C1CCN(CC2CCOCC2)C1