Reaction Details
TargetEstrogen receptor
LigandBDBM20592
Substrate/Competitor17beta-estradiol (E2)
Meas. Tech.ER-alpha Radioligand Binding Assay and ERE-Luciferase Reporter Assay.
pH7.4±n/a
Temperature295.15±n/a K
IC50 31±2 nM
EC50 1.6±0.3 nM
CommentsAntagonist activity in MCF-7 assay, IC50= 3.5 +/- 0.9 nM; in the absence of 17beta-estradiol in the MCF-7 proliferation assay, compound displayed 16 +/- 6 % agonistic effect.
Citation Renaud, JBischoff, SFBuhl, TFloersheim, PFournier, BHalleux, CKallen, JKeller, HSchlaeppi, JMStark, W Estrogen receptor modulators: identification and structure-activity relationships of potent ERalpha-selective tetrahydroisoquinoline ligands. J Med Chem46:2945-57 (2003) 
 
Estrogen receptor
Name:Estrogen receptor
Type:Protein
Mol. Mass.:66230.44
Organism:Homo sapiens (Human)
Description:P03372
Residue:595
BDBM20592
17beta-estradiol (E2)
NameBDBM20592
Synonyms:2-(4-fluorophenyl)-1-methyl-1-{4-[2-(pyrrolidin-1-yl)ethoxy]phenyl}-1,2,3,4-tetrahydroisoquinolin-6-ol | tetrahydroisoquinoline derivative, 19c
TypeSmall organic molecule
Emp. Form.C28H31FN2O2
Mol. Mass.446.5563
SMILESCC1(N(CCc2cc(O)ccc12)c1ccc(F)cc1)c1ccc(OCCN2CCCC2)cc1