Reaction Details
TargetEstrogen receptor
LigandBDBM20599
Substrate/Competitor17beta-estradiol (E2)
Meas. Tech.ER-alpha Radioligand Binding Assay and ERE-Luciferase Reporter Assay.
pH7.4±n/a
Temperature295.15±n/a K
IC50 34±16 nM
EC50 0.7±0.1 nM
CommentsAntagonist activity in MCF-7 assay, IC50= 2.0 +/- 1.0 nM; in the absence of 17beta-estradiol in the MCF-7 proliferation assay, compound displayed 10 +/- 9 % agonistic effect.
Citation Renaud, JBischoff, SFBuhl, TFloersheim, PFournier, BHalleux, CKallen, JKeller, HSchlaeppi, JMStark, W Estrogen receptor modulators: identification and structure-activity relationships of potent ERalpha-selective tetrahydroisoquinoline ligands. J Med Chem46:2945-57 (2003) 
 
Estrogen receptor
Name:Estrogen receptor
Type:Protein
Mol. Mass.:66230.44
Organism:Homo sapiens (Human)
Description:P03372
Residue:595
BDBM20599
17beta-estradiol (E2)
NameBDBM20599
Synonyms:2-(3-hydroxyphenyl)-1-methyl-1-{4-[2-(piperidin-1-yl)ethoxy]phenyl}-1,2,3,4-tetrahydroisoquinolin-6-ol | tetrahydroisoquinoline derivative, 20f
TypeSmall organic molecule
Emp. Form.C29H34N2O3
Mol. Mass.458.5919
SMILESCC1(N(CCc2cc(O)ccc12)c1cccc(O)c1)c1ccc(OCCN2CCCCC2)cc1