Reaction Details
TargetEstrogen receptor
LigandBDBM20600
Substrate/Competitor17beta-estradiol (E2)
Meas. Tech.ER-alpha Radioligand Binding Assay and ERE-Luciferase Reporter Assay.
pH7.4±n/a
Temperature295.15±n/a K
IC50 39±17 nM
EC50 3.0±1.4 nM
CommentsAntagonist activity in MCF-7 assay, IC50=3.8 +/- 1.0 nM; in the absence of 17beta-estradiol in the MCF-7 proliferation assay, compound displayed 5 +/- 4 % agonistic effect.
Citation Renaud, JBischoff, SFBuhl, TFloersheim, PFournier, BHalleux, CKallen, JKeller, HSchlaeppi, JMStark, W Estrogen receptor modulators: identification and structure-activity relationships of potent ERalpha-selective tetrahydroisoquinoline ligands. J Med Chem46:2945-57 (2003) 
 
Estrogen receptor
Name:Estrogen receptor
Type:Protein
Mol. Mass.:66230.44
Organism:Homo sapiens (Human)
Description:P03372
Residue:595
BDBM20600
17beta-estradiol (E2)
NameBDBM20600
Synonyms:2-(3-fluorophenyl)-1-methyl-1-{4-[2-(pyrrolidin-1-yl)ethoxy]phenyl}-1,2,3,4-tetrahydroisoquinolin-6-ol | tetrahydroisoquinoline derivative, 19g
TypeSmall organic molecule
Emp. Form.C28H31FN2O2
Mol. Mass.446.5563
SMILESCC1(N(CCc2cc(O)ccc12)c1cccc(F)c1)c1ccc(OCCN2CCCC2)cc1