Reaction Details
TargetEstrogen receptor
LigandBDBM20608
Substrate/Competitor17beta-estradiol (E2)
Meas. Tech.ER-alpha Radioligand Binding Assay and ERE-Luciferase Reporter Assay.
pH7.4±n/a
Temperature295.15±n/a K
IC50 17±n/a nM
EC50 10.3±7.7 nM
CommentsAntagonist activity in MCF-7 assay, IC50 =8.5 +/- 8.0 nM; in the absence of 17beta-estradiol in the MCF-7 proliferation assay, compound displayed 31 +/- 8 % agonistic effect.
Citation Renaud, JBischoff, SFBuhl, TFloersheim, PFournier, BHalleux, CKallen, JKeller, HSchlaeppi, JMStark, W Estrogen receptor modulators: identification and structure-activity relationships of potent ERalpha-selective tetrahydroisoquinoline ligands. J Med Chem46:2945-57 (2003) 
 
Estrogen receptor
Name:Estrogen receptor
Type:Protein
Mol. Mass.:66230.44
Organism:Homo sapiens (Human)
Description:P03372
Residue:595
BDBM20608
17beta-estradiol (E2)
NameBDBM20608
Synonyms:4-Hydroxytamoxifen 4-[(1Z)-1-{4-[2-(dimethylamino)ethoxy]phenyl}-2-phenylbut-1-en-1-yl]phenol CHEMBL489 cid_449459
TypeSmall organic molecule
Emp. Form.C26H29NO2
Mol. Mass.387.514
SMILESCC\C(=C(/c1ccc(O)cc1)c1ccc(OCCN(C)C)cc1)c1ccccc1