Reaction Details
TargetEstrogen receptor beta
LigandBDBM20584
Substrate/Competitor17beta-estradiol (E2)
Meas. Tech.ER-alpha Radioligand Binding Assay and ERE-Luciferase Reporter Assay.
Temperature298.15±n/a K
IC50 421±n/a nM
Commentsextracted
Citation Renaud, JBischoff, SFBuhl, TFloersheim, PFournier, BHalleux, CKallen, JKeller, HSchlaeppi, JMStark, W Estrogen receptor modulators: identification and structure-activity relationships of potent ERalpha-selective tetrahydroisoquinoline ligands. J Med Chem46:2945-57 (2003) 
 
Estrogen receptor beta
Name:Estrogen receptor beta
Type:Protein
Mol. Mass.:59238.43
Organism:Homo sapiens (Human)
Description:Q92731
Residue:530
BDBM20584
17beta-estradiol (E2)
NameBDBM20584
Synonyms:1-(4-fluorophenyl)-2-phenyl-1,2,3,4-tetrahydroisoquinolin-6-ol | tetrahydroisoquinoline derivative, 27
TypeSmall organic molecule
Emp. Form.C21H18FNO
Mol. Mass.319.3721
SMILESOc1ccc2C(N(CCc2c1)c1ccccc1)c1ccc(F)cc1