Reaction Details
TargetEstrogen receptor beta
LigandBDBM20589
Substrate/Competitor17beta-estradiol (E2)
Meas. Tech.ER-alpha Radioligand Binding Assay and ERE-Luciferase Reporter Assay.
Temperature298.15±n/a K
IC50 200±n/a nM
EC50 80±n/a nM
Commentsextracted
Citation Renaud, JBischoff, SFBuhl, TFloersheim, PFournier, BHalleux, CKallen, JKeller, HSchlaeppi, JMStark, W Estrogen receptor modulators: identification and structure-activity relationships of potent ERalpha-selective tetrahydroisoquinoline ligands. J Med Chem46:2945-57 (2003) 
 
Estrogen receptor beta
Name:Estrogen receptor beta
Type:Protein
Mol. Mass.:59238.43
Organism:Homo sapiens (Human)
Description:Q92731
Residue:530
BDBM20589
17beta-estradiol (E2)
NameBDBM20589
Synonyms:1-{4-[2-(azepan-1-yl)ethoxy]phenyl}-1-methyl-2-phenyl-1,2,3,4-tetrahydroisoquinolin-6-ol | tetrahydroisoquinoline derivative, 26a
TypeSmall organic molecule
Emp. Form.C30H36N2O2
Mol. Mass.456.619
SMILESCC1(N(CCc2cc(O)ccc12)c1ccccc1)c1ccc(OCCN2CCCCCC2)cc1