Reaction Details
TargetEstrogen receptor beta
LigandBDBM20596
Substrate/Competitor17beta-estradiol (E2)
Meas. Tech.ER-alpha Radioligand Binding Assay and ERE-Luciferase Reporter Assay.
Temperature298.15±n/a K
IC50 1974±n/a nM
EC50 4974±n/a nM
Commentsextracted
Citation Renaud, JBischoff, SFBuhl, TFloersheim, PFournier, BHalleux, CKallen, JKeller, HSchlaeppi, JMStark, W Estrogen receptor modulators: identification and structure-activity relationships of potent ERalpha-selective tetrahydroisoquinoline ligands. J Med Chem46:2945-57 (2003) 
 
Estrogen receptor beta
Name:Estrogen receptor beta
Type:Protein
Mol. Mass.:59238.43
Organism:Homo sapiens (Human)
Description:Q92731
Residue:530
BDBM20596
17beta-estradiol (E2)
NameBDBM20596
Synonyms:1-methyl-2-[4-(propan-2-yl)phenyl]-1-{4-[2-(pyrrolidin-1-yl)ethoxy]phenyl}-1,2,3,4-tetrahydroisoquinolin-6-ol | tetrahydroisoquinoline derivative, 19e
TypeSmall organic molecule
Emp. Form.C31H38N2O2
Mol. Mass.470.6456
SMILESCC(C)c1ccc(cc1)N1CCc2cc(O)ccc2C1(C)c1ccc(OCCN2CCCC2)cc1