Reaction Details
TargetEstrogen receptor beta
LigandBDBM20604
Substrate/Competitor17beta-estradiol (E2)
Meas. Tech.ER-alpha Radioligand Binding Assay and ERE-Luciferase Reporter Assay.
Temperature298.15±n/a K
IC50 2205±n/a nM
EC50 2974±n/a nM
Commentsextracted
Citation Renaud, JBischoff, SFBuhl, TFloersheim, PFournier, BHalleux, CKallen, JKeller, HSchlaeppi, JMStark, W Estrogen receptor modulators: identification and structure-activity relationships of potent ERalpha-selective tetrahydroisoquinoline ligands. J Med Chem46:2945-57 (2003) 
 
Estrogen receptor beta
Name:Estrogen receptor beta
Type:Protein
Mol. Mass.:59238.43
Organism:Homo sapiens (Human)
Description:Q92731
Residue:530
BDBM20604
17beta-estradiol (E2)
NameBDBM20604
Synonyms:2-[3-(dimethylamino)phenyl]-1-methyl-1-{4-[2-(pyrrolidin-1-yl)ethoxy]phenyl}-1,2,3,4-tetrahydroisoquinolin-6-ol | tetrahydroisoquinoline derivative, 19j
TypeSmall organic molecule
Emp. Form.C30H37N3O2
Mol. Mass.471.6337
SMILESCN(C)c1cccc(c1)N1CCc2cc(O)ccc2C1(C)c1ccc(OCCN2CCCC2)cc1