Reaction Details
TargetEstrogen receptor
LigandBDBM20630
Substrate/Competitor17beta-estradiol (E2)
Meas. Tech.ER-alpha Radioligand Binding Assay and ERE-Luciferase Reporter Assay.
pH7.4±n/a
Temperature295.15±n/a K
IC50 3650±n/a nM
EC50 148±n/a nM
Citation Schopfer, USchoeffter, PBischoff, SFNozulak, JFeuerbach, DFloersheim, P Toward selective ERbeta agonists for central nervous system disorders: synthesis and characterization of aryl benzthiophenes. J Med Chem45:1399-401 (2002) 
 
Estrogen receptor
Name:Estrogen receptor
Type:Protein
Mol. Mass.:66230.44
Organism:Homo sapiens (Human)
Description:P03372
Residue:595
BDBM20630
17beta-estradiol (E2)
NameBDBM20630
Synonyms:2-(4-hydroxy-3-methylphenyl)-1-benzothiophen-6-ol | benzthiophene compound, 5
TypeSmall organic molecule
Emp. Form.C15H12O2S
Mol. Mass.256.32
SMILESCc1cc(ccc1O)-c1cc2ccc(O)cc2s1