Reaction Details
TargetEstrogen receptor beta
LigandBDBM20625
Substrate/Competitor17beta-estradiol (E2)
Meas. Tech.ER-beta Radioligand Binding Assay and ERE-Luciferase Reporter Assay.
pH7.4±n/a
Temperature295.15±n/a K
IC50 9±n/a nM
EC50 0.02±n/a nM
Citation Schopfer, USchoeffter, PBischoff, SFNozulak, JFeuerbach, DFloersheim, P Toward selective ERbeta agonists for central nervous system disorders: synthesis and characterization of aryl benzthiophenes. J Med Chem45:1399-401 (2002) 
 
Estrogen receptor beta
Name:Estrogen receptor beta
Type:Protein
Mol. Mass.:59238.43
Organism:Homo sapiens (Human)
Description:Q92731
Residue:530
BDBM20625
17beta-estradiol (E2)
NameBDBM20625
Synonyms:4-[(3E)-4-(4-hydroxyphenyl)hex-3-en-3-yl]phenol CHEMBL411 Diethylstilbestrol (1) Stilboestroform
TypeSmall organic molecule
Emp. Form.C18H20O2
Mol. Mass.268.3502
SMILESCC\C(=C(\CC)c1ccc(O)cc1)c1ccc(O)cc1