Reaction Details
TargetEstrogen receptor beta
LigandBDBM20632
Substrate/Competitor17beta-estradiol (E2)
Meas. Tech.ER-alpha Radioligand Binding Assay and ERE-Luciferase Reporter Assay.
Temperature298.15±n/a K
IC50 3940±n/a nM
EC50 186±n/a nM
Commentsextracted
Citation Schopfer, USchoeffter, PBischoff, SFNozulak, JFeuerbach, DFloersheim, P Toward selective ERbeta agonists for central nervous system disorders: synthesis and characterization of aryl benzthiophenes. J Med Chem45:1399-401 (2002) 
 
Estrogen receptor beta
Name:Estrogen receptor beta
Type:Protein
Mol. Mass.:59238.43
Organism:Homo sapiens (Human)
Description:Q92731
Residue:530
BDBM20632
17beta-estradiol (E2)
NameBDBM20632
Synonyms:2-(4-hydroxy-3-propylphenyl)-1-benzothiophen-6-ol | benzthiophene compound, 7
TypeSmall organic molecule
Emp. Form.C17H16O2S
Mol. Mass.284.373
SMILESCCCc1cc(ccc1O)-c1cc2ccc(O)cc2s1