Reaction Details
TargetEstrogen receptor beta
LigandBDBM20634
Substrate/Competitor17beta-estradiol (E2)
Meas. Tech.ER-alpha Radioligand Binding Assay and ERE-Luciferase Reporter Assay.
Temperature298.15±n/a K
IC50 740±n/a nM
EC50 245±n/a nM
Commentsextracted
Citation Schopfer, USchoeffter, PBischoff, SFNozulak, JFeuerbach, DFloersheim, P Toward selective ERbeta agonists for central nervous system disorders: synthesis and characterization of aryl benzthiophenes. J Med Chem45:1399-401 (2002) 
 
Estrogen receptor beta
Name:Estrogen receptor beta
Type:Protein
Mol. Mass.:59238.43
Organism:Homo sapiens (Human)
Description:Q92731
Residue:530
BDBM20634
17beta-estradiol (E2)
NameBDBM20634
Synonyms:2-(3-hydroxyphenyl)-1-benzothiophen-6-ol | benzthiophene compound, 9
TypeSmall organic molecule
Emp. Form.C14H10O2S
Mol. Mass.242.293
SMILESOc1cccc(c1)-c1cc2ccc(O)cc2s1