Reaction Details
TargetThymidylate synthase
LigandBDBM20683
Substrate/CompetitorBDBM18754
Meas. Tech.Thymidylate Synthase (TS) Assay
pH7.4±n/a
Temperature303.15±n/a K
IC50 15000±n/a nM
Citation Gangjee, ALi, WYang, JKisliuk, RL Design, synthesis, and biological evaluation of classical and nonclassical 2-amino-4-oxo-5-substituted-6-methylpyrrolo[3,2-d]pyrimidines as dual thymidylate synthase and dihydrofolate reductase inhibitors. J Med Chem51:68-76 (2008) 
 
Thymidylate synthase
Name:Thymidylate synthase
Type:Enzyme
Mol. Mass.:30475.81
Organism:Escherichia coli
Description:n/a
Residue:264
BDBM20683
BDBM18754
NameBDBM20683
Synonyms:2-amino-5-[(4-methoxyphenyl)methyl]-6-methyl-3H,4H,5H-pyrrolo[3,2-d]pyrimidin-4-one | Pyrrolo[3,2-d]pyrimidine analogue, 11
TypeSmall organic molecule
Emp. Form.C15H16N4O2
Mol. Mass.284.3131
SMILESCOc1ccc(Cn2c(C)cc3nc(N)[nH]c(=O)c23)cc1