Reaction Details
TargetBifunctional dihydrofolate reductase-thymidylate synthase
LigandBDBM18796
Substrate/CompetitorBDBM18754
Meas. Tech.Thymidylate Synthase (TS) Assay
IC50 2800±n/a nM
Citation Gangjee, ALi, WYang, JKisliuk, RL Design, synthesis, and biological evaluation of classical and nonclassical 2-amino-4-oxo-5-substituted-6-methylpyrrolo[3,2-d]pyrimidines as dual thymidylate synthase and dihydrofolate reductase inhibitors. J Med Chem51:68-76 (2008) 
 
Bifunctional dihydrofolate reductase-thymidylate synthase
Name:Bifunctional dihydrofolate reductase-thymidylate synthase
Type:Enzyme
Mol. Mass.:68757.49
Organism:Toxoplasma gondii
Description:Q07422
Residue:610
BDBM18796
BDBM18754
NameBDBM18796
Synonyms:(2S)-2-{[4-(2-{2-amino-4-oxo-1H,4H,7H-pyrrolo[2,3-d]pyrimidin-5-yl}ethyl)phenyl]formamido}pentanedioic acid Pemetrexed
TypeSmall organic molecule
Emp. Form.C20H21N5O6
Mol. Mass.427.4106
SMILESNc1nc2[nH]cc(CCc3ccc(cc3)C(=O)N[C@@H](CCC(O)=O)C(O)=O)c2c(=O)[nH]1