Reaction Details
TargetTyrosine-protein kinase JAK2
LigandBDBM366670
Substrate/Competitorn/a
Meas. Tech.Enzyme Assay
Ki 0.250±n/a nM
Citation Ray, NCCheng, YEdwards, CGoodacre, SCLi, WPatel, SCartwright, MWSajad, MYuen, PZak, ME Triazolopyridine compounds, compositions and methods of use thereof US Patent US9873709 Publication Date 1/23/2018
 
Tyrosine-protein kinase JAK2
Name:Tyrosine-protein kinase JAK2
Type:Protein
Mol. Mass.:130684.68
Organism:Homo sapiens (Human)
Description:O60674
Residue:1132
BDBM366670
NameBDBM366670
Synonyms:4-[[8-[4-[4- (difluoromethyl)phenyl]- 4-(hydroxymethyl)- 1-piperidyl]- [1,2,4]triazolo[1,5- a]pyridin-2-yl]amino]- N-methyl-N-(1- methyl-4- piperidyl)benzamide | US9873709, Example 1-267
TypeSmall organic molecule
Emp. Form.C33H39F2N7O2
Mol. Mass.603.7053
SMILESCN(C1CCN(C)CC1)C(=O)c1ccc(Nc2nc3c(cccn3n2)N2CCC(CO)(CC2)c2ccc(cc2)C(F)F)cc1