Reaction Details
TargetTyrosine-protein kinase JAK2
LigandBDBM366677
Substrate/Competitorn/a
Meas. Tech.Enzyme Assay
Ki 0.170±n/a nM
Citation Ray, NCCheng, YEdwards, CGoodacre, SCLi, WPatel, SCartwright, MWSajad, MYuen, PZak, ME Triazolopyridine compounds, compositions and methods of use thereof US Patent US9873709 Publication Date 1/23/2018
 
Tyrosine-protein kinase JAK2
Name:Tyrosine-protein kinase JAK2
Type:Protein
Mol. Mass.:130684.68
Organism:Homo sapiens (Human)
Description:O60674
Residue:1132
BDBM366677
NameBDBM366677
Synonyms:US9873709, Example 1-274 | [4-[[8-[4-(4- chlorophenyl)-4- (hydroxymethyl)-1- piperidyl]- [1,2,4]triazolo[1,5- a]pyridin-2- yl]amino]phenyl]-(5- methyl-2,5- diazaspiro[3.4]octan- 2-yl)methanone
TypeSmall organic molecule
Emp. Form.C33H37ClN6O2
Mol. Mass.585.139
SMILESCN1CCCC11CC(C1)C(=O)c1ccc(Nc2nc3c(cccn3n2)N2CCC(CO)(CC2)c2ccc(Cl)cc2)cc1