Reaction Details
TargetTyrosine-protein kinase JAK1
LigandBDBM366694
Substrate/Competitorn/a
Meas. Tech.Enzyme Assay
Ki 0.180±n/a nM
Citation Ray, NCCheng, YEdwards, CGoodacre, SCLi, WPatel, SCartwright, MWSajad, MYuen, PZak, ME Triazolopyridine compounds, compositions and methods of use thereof US Patent US9873709 Publication Date 1/23/2018
 
Tyrosine-protein kinase JAK1
Name:Tyrosine-protein kinase JAK1
Type:Protein
Mol. Mass.:133293.73
Organism:Homo sapiens (Human)
Description:P23458
Residue:1154
BDBM366694
NameBDBM366694
Synonyms:2-[4-[[8-[4-(4- chlorophenyl)-4- (hydroxymethyl)-1- piperidyl]- [1,2,4]triazolo[1,5- a]pyridin-2- yl]amino]pyrazol-1- yl]-1-[4- (methylamino)-1- piperidyl]ethanone | US9873709, Example 1-291
TypeSmall organic molecule
Emp. Form.C29H36ClN9O2
Mol. Mass.578.108
SMILESCNC1CCN(CC1)C(=O)Cn1cc(Nc2nc3c(cccn3n2)N2CCC(CO)(CC2)c2ccc(Cl)cc2)cn1