Reaction Details
TargetTyrosine-protein kinase JAK2
LigandBDBM367041
Substrate/Competitorn/a
Meas. Tech.Enzyme Assay
Ki 0.220±n/a nM
Citation Ray, NCCheng, YEdwards, CGoodacre, SCLi, WPatel, SCartwright, MWSajad, MYuen, PZak, ME Triazolopyridine compounds, compositions and methods of use thereof US Patent US9873709 Publication Date 1/23/2018
 
Tyrosine-protein kinase JAK2
Name:Tyrosine-protein kinase JAK2
Type:Protein
Mol. Mass.:130684.68
Organism:Homo sapiens (Human)
Description:O60674
Residue:1132
BDBM367041
NameBDBM367041
Synonyms:4,4,4-trifluoro-1-[4-[2- [4-[3-(4- pyridyl)pyrrolidine-1- carbonyl]anilino]- [1,2,4]triazolo[1,5- a]pyridin-8-yl]-3,6- dihydro-2H-pyridin-1- yl]butan-1-one | US9873709, Example 2-338
TypeSmall organic molecule
Emp. Form.C31H30F3N7O2
Mol. Mass.589.6108
SMILESFC(F)(F)CCC(=O)N1CCC(=CC1)c1cccn2nc(Nc3ccc(cc3)C(=O)N3CCC(C3)c3ccncc3)nc12