Reaction Details
TargetNuclear factor NF-kappa-B p105 subunit
LigandBDBM367265
Substrate/Competitorn/a
Meas. Tech.Electrophoretic Mobility Shift Assay (EMSA)
IC50<500±n/a nM
Citation Ouk, SLiou, H Small molecule NF-κB inhibitors US Patent US10226464 Publication Date 3/12/2019
 
Nuclear factor NF-kappa-B p105 subunit
Name:Nuclear factor NF-kappa-B p105 subunit
Type:Protein
Mol. Mass.:105329.57
Organism:Homo sapiens (Human)
Description:P19838
Residue:968
BDBM367265
NameBDBM367265
Synonyms:US10226464, Compound 33
TypeSmall organic molecule
Emp. Form.C16H15FN2O4
Mol. Mass.318.2997
SMILESCC(C)CCOc1cc2oc3nc(=O)[nH]c(=O)c3cc2cc1F