Reaction Details
TargetNuclear factor NF-kappa-B p105 subunit
LigandBDBM367299
Substrate/Competitorn/a
Meas. Tech.Electrophoretic Mobility Shift Assay (EMSA)
IC50<1000±n/a nM
Citation Ouk, SLiou, H Small molecule NF-κB inhibitors US Patent US10226464 Publication Date 3/12/2019
 
Nuclear factor NF-kappa-B p105 subunit
Name:Nuclear factor NF-kappa-B p105 subunit
Type:Protein
Mol. Mass.:105329.57
Organism:Homo sapiens (Human)
Description:P19838
Residue:968
BDBM367299
NameBDBM367299
Synonyms:US10226464, Compound 66
TypeSmall organic molecule
Emp. Form.C16H15ClN2O5
Mol. Mass.350.754
SMILESCOCCCCOc1ccc2cc3c(nc(=O)[nH]c3=O)oc2c1Cl