Reaction Details
TargetHistone deacetylase 1
LigandBDBM50398725
Substrate/Competitorn/a
Meas. Tech.HDAC Inhibition Assays
IC50 1910±570 nM
Citation Sotomayor, EMBergman, JAKozikowski, APVillagra, AVWoan, KV Selective histone deactylase 6 inhibitors US Patent US10227295 Publication Date 3/12/2019
 
Histone deacetylase 1
Name:Histone deacetylase 1
Type:Enzyme
Mol. Mass.:55090.27
Organism:Homo sapiens (Human)
Description:Q13547
Residue:482
BDBM50398725
NameBDBM50398725
Synonyms:CHEMBL2179249 US9409858, 5b US9956192, Compound 5b
TypeSmall organic molecule
Emp. Form.C19H23N3O5
Mol. Mass.373.403
SMILESCOc1ccccc1NC(=O)N(CCCO)Cc1ccc(cc1)C(=O)NO