Reaction Details
TargetHistone deacetylase 1
LigandBDBM50398721
Substrate/Competitorn/a
Meas. Tech.HDAC Inhibition Assays
IC50 2250±420 nM
Citation Sotomayor, EMBergman, JAKozikowski, APVillagra, AVWoan, KV Selective histone deactylase 6 inhibitors US Patent US10227295 Publication Date 3/12/2019
 
Histone deacetylase 1
Name:Histone deacetylase 1
Type:Enzyme
Mol. Mass.:55090.27
Organism:Homo sapiens (Human)
Description:Q13547
Residue:482
BDBM50398721
NameBDBM50398721
Synonyms:CHEMBL2179617 US9409858, 5f US9956192, Compound 5f
TypeSmall organic molecule
Emp. Form.C18H21N3O4
Mol. Mass.343.377
SMILESCOCCN(Cc1ccc(cc1)C(=O)NO)C(=O)Nc1ccccc1