Reaction Details
TargetHistone deacetylase 6
LigandBDBM50398721
Substrate/Competitorn/a
Meas. Tech.HDAC Inhibition Assays
IC50 9.26±0.66 nM
Citation Sotomayor, EMBergman, JAKozikowski, APVillagra, AVWoan, KV Selective histone deactylase 6 inhibitors US Patent US10227295 Publication Date 3/12/2019
 
Histone deacetylase 6
Name:Histone deacetylase 6
Type:Chromatin regulator; hydrolase; repressor
Mol. Mass.:131381.51
Organism:Homo sapiens (Human)
Description:Q9UBN7
Residue:1215
BDBM50398721
NameBDBM50398721
Synonyms:CHEMBL2179617 US9409858, 5f US9956192, Compound 5f
TypeSmall organic molecule
Emp. Form.C18H21N3O4
Mol. Mass.343.377
SMILESCOCCN(Cc1ccc(cc1)C(=O)NO)C(=O)Nc1ccccc1