Reaction Details
TargetHistone deacetylase 1
LigandBDBM50398716
Substrate/Competitorn/a
Meas. Tech.HDAC Inhibition Assays
IC50 3020±740 nM
Citation Sotomayor, EMBergman, JAKozikowski, APVillagra, AVWoan, KV Selective histone deactylase 6 inhibitors US Patent US10227295 Publication Date 3/12/2019
 
Histone deacetylase 1
Name:Histone deacetylase 1
Type:Enzyme
Mol. Mass.:55090.27
Organism:Homo sapiens (Human)
Description:Q13547
Residue:482
BDBM50398716
NameBDBM50398716
Synonyms:CHEMBL2179618 US9409858, 5g US9956192, Compound 5g
TypeSmall organic molecule
Emp. Form.C19H23N3O3
Mol. Mass.341.4042
SMILESCCCCN(Cc1ccc(cc1)C(=O)NO)C(=O)Nc1ccccc1