Reaction Details
TargetMitogen-activated protein kinase 14
LigandBDBM247061
Substrate/Competitorn/a
Meas. Tech.p38 MAPKalpaha Enzyme Inhibition 1
IC50 1.000±n/a nM
Citation Cariou, CACharron, CEFordyce, EAHamza, DFyfe, MCIto, KKing-Underwood, JMurray, PJOnions, STThom, SMWatson, HTWilliams, JG Pyrazolyl-ureas as kinase inhibitors US Patent US9701670 Publication Date 7/11/2017
 
Mitogen-activated protein kinase 14
Name:Mitogen-activated protein kinase 14
Type:Serine/threonine-protein kinase
Mol. Mass.:41286.76
Organism:Homo sapiens (Human)
Description:Q16539
Residue:360
BDBM247061
NameBDBM247061
Synonyms:N-(2-(Dimethylamino)ethyl)-3-((4-((4-(3-(3-isopropyl-1-(p-tolyl)-1H-pyrazol-5-yl)ureido)naphthalen-1-yl)oxy)pyrimidin-2-yl)amino)-5-methoxybenzamide | US9701670, 5
TypeSmall organic molecule
Emp. Form.C40H43N9O4
Mol. Mass.713.8273
SMILESCOc1cc(Nc2nccc(Oc3ccc(NC(=O)Nc4cc(nn4-c4ccc(C)cc4)C(C)C)c4ccccc34)n2)cc(c1)C(=O)NCCN(C)C