Reaction Details
TargetProto-oncogene tyrosine-protein kinase Src
LigandBDBM247080
Substrate/Competitorn/a
Meas. Tech.c-Src Enzyme Inhibition 1
IC50 1.000±n/a nM
Citation Cariou, CACharron, CEFordyce, EAHamza, DFyfe, MCIto, KKing-Underwood, JMurray, PJOnions, STThom, SMWatson, HTWilliams, JG Pyrazolyl-ureas as kinase inhibitors US Patent US9701670 Publication Date 7/11/2017
 
Proto-oncogene tyrosine-protein kinase Src
Name:Proto-oncogene tyrosine-protein kinase Src
Type:Protein
Mol. Mass.:59838.60
Organism:Homo sapiens (Human)
Description:P12931
Residue:536
BDBM247080
NameBDBM247080
Synonyms:3-((4-((4-(3-(3-(tert-butyl)-1-(4-methylthiophen-2-yl)-1H-pyrazol-5-yl)ureido)naphthalen-1-yl)oxy)pyrimidin-2-yl)amino)-N-(2-morpholinoethyl)benzamide | US9701670, 24
TypeSmall organic molecule
Emp. Form.C40H43N9O4S
Mol. Mass.745.892
SMILESCc1csc(c1)-n1nc(cc1NC(=O)Nc1ccc(Oc2ccnc(Nc3cccc(c3)C(=O)NCCN3CCOCC3)n2)c2ccccc12)C(C)(C)C