Reaction Details
TargetProto-oncogene tyrosine-protein kinase Src
LigandBDBM247085
Substrate/Competitorn/a
Meas. Tech.c-Src Enzyme Inhibition 1
IC50<1.000±n/a nM
Citation Cariou, CACharron, CEFordyce, EAHamza, DFyfe, MCIto, KKing-Underwood, JMurray, PJOnions, STThom, SMWatson, HTWilliams, JG Pyrazolyl-ureas as kinase inhibitors US Patent US9701670 Publication Date 7/11/2017
 
Proto-oncogene tyrosine-protein kinase Src
Name:Proto-oncogene tyrosine-protein kinase Src
Type:Protein
Mol. Mass.:59838.60
Organism:Homo sapiens (Human)
Description:P12931
Residue:536
BDBM247085
NameBDBM247085
Synonyms:3-((4-((4-(3-(3-(tert-butyl)-1-(p-tolyl)-1H-pyrazol-5-yl)ureido)naphthalen-1-yl)oxy)pyrimidin-2-yl)amino)-N-(2-(dimethylamino)ethyl)-4-methoxybenzamide | US9701670, 29
TypeSmall organic molecule
Emp. Form.C41H45N9O5
Mol. Mass.743.8533
SMILESCOc1ccc(cc1)-n1nc(cc1NC(=O)Nc1ccc(Oc2ccnc(Nc3cc(ccc3OC)C(=O)NCCN(C)C)n2)c2ccccc12)C(C)(C)C