Reaction Details
TargetMitogen-activated protein kinase 14
LigandBDBM247088
Substrate/Competitorn/a
Meas. Tech.p38 MAPKalpaha Enzyme Inhibition 1
IC50 1.000±n/a nM
Citation Cariou, CACharron, CEFordyce, EAHamza, DFyfe, MCIto, KKing-Underwood, JMurray, PJOnions, STThom, SMWatson, HTWilliams, JG Pyrazolyl-ureas as kinase inhibitors US Patent US9701670 Publication Date 7/11/2017
 
Mitogen-activated protein kinase 14
Name:Mitogen-activated protein kinase 14
Type:Serine/threonine-protein kinase
Mol. Mass.:41286.76
Organism:Homo sapiens (Human)
Description:Q16539
Residue:360
BDBM247088
NameBDBM247088
Synonyms:N-(2-hydroxyethyl)-3-((4-((4-(3-(3-isopropyl-1-(p-tolyl)-1H-pyrazol-5-yl)ureido)naphthalen-1-yl)oxy)pyrimidin-2-yl)amino)-4-methoxybenzamide | US9701670, 32
TypeSmall organic molecule
Emp. Form.C38H38N8O5
Mol. Mass.686.7589
SMILESCOc1ccc(cc1Nc1nccc(Oc2ccc(NC(=O)Nc3cc(nn3-c3ccc(C)cc3)C(C)C)c3ccccc23)n1)C(=O)NCCO