Reaction Details
TargetProto-oncogene tyrosine-protein kinase Src
LigandBDBM247111
Substrate/Competitorn/a
Meas. Tech.c-Src Enzyme Inhibition 1
IC50 5.00±n/a nM
Citation Cariou, CACharron, CEFordyce, EAHamza, DFyfe, MCIto, KKing-Underwood, JMurray, PJOnions, STThom, SMWatson, HTWilliams, JG Pyrazolyl-ureas as kinase inhibitors US Patent US9701670 Publication Date 7/11/2017
 
Proto-oncogene tyrosine-protein kinase Src
Name:Proto-oncogene tyrosine-protein kinase Src
Type:Protein
Mol. Mass.:59838.60
Organism:Homo sapiens (Human)
Description:P12931
Residue:536
BDBM247111
NameBDBM247111
Synonyms:3-((4-((4-(3-(1-(3,4-dimethylphenyl)-3-isopropyl-1H-pyrazol-5-yl)ureido)naphthalen-1-yl)oxy)pyrimidin-2-yl)amino)-5-methoxy-N-(2-morpholinoethyl)benzamide | US9701670, 56
TypeSmall organic molecule
Emp. Form.C43H47N9O5
Mol. Mass.769.8906
SMILESCOc1cc(Nc2nccc(Oc3ccc(NC(=O)Nc4cc(nn4-c4ccc(C)c(C)c4)C(C)C)c4ccccc34)n2)cc(c1)C(=O)NCCN1CCOCC1