Reaction Details
TargetSerine/threonine-protein kinase/endoribonuclease IRE1
LigandBDBM160339
Substrate/Competitorn/a
Meas. Tech.IRE-1alpha Assay
pH7.5±n/a
Temperature303.15±n/a K
IC50<100±n/a nM
EC50<10000±n/a nM
Commentsextracted
Citation Zeng, QToro, APatterson, JBWade, WSZubovics, ZYang, YWu, Z IRE-1α inhibitors US Patent US9693992 Publication Date 7/4/2017
 
Serine/threonine-protein kinase/endoribonuclease IRE1
Name:Serine/threonine-protein kinase/endoribonuclease IRE1
Type:Enzyme
Mol. Mass.:109731.20
Organism:Homo sapiens (Human)
Description:O75460
Residue:977
BDBM160339
NameBDBM160339
Synonyms:US9040714, 6 | US9693992, 6
TypeSmall organic molecule
Emp. Form.C12H9BrO5
Mol. Mass.313.101
SMILESCOc1cc2c(C)c(Br)c(=O)oc2c(C=O)c1O