Reaction Details
TargetSerine/threonine-protein kinase/endoribonuclease IRE1
LigandBDBM160344
Substrate/Competitorn/a
Meas. Tech.IRE-1alpha Assay
pH7.5±n/a
Temperature303.15±n/a K
IC50<100±n/a nM
EC50<10000±n/a nM
Commentsextracted
Citation Zeng, QToro, APatterson, JBWade, WSZubovics, ZYang, YWu, Z IRE-1α inhibitors US Patent US9693992 Publication Date 7/4/2017
 
Serine/threonine-protein kinase/endoribonuclease IRE1
Name:Serine/threonine-protein kinase/endoribonuclease IRE1
Type:Enzyme
Mol. Mass.:109731.20
Organism:Homo sapiens (Human)
Description:O75460
Residue:977
BDBM160344
NameBDBM160344
Synonyms:US9040714, 11 | US9693992, 11
TypeSmall organic molecule
Emp. Form.C24H24N2O6
Mol. Mass.436.4572
SMILESCc1c(-c2cccc(c2)C(=O)NCCN2CCOCC2)c(=O)oc2c(C=O)c(O)ccc12