Reaction Details
TargetSerine/threonine-protein kinase/endoribonuclease IRE1
LigandBDBM160356
Substrate/Competitorn/a
Meas. Tech.IRE-1alpha Assay
pH7.5±n/a
Temperature303.15±n/a K
IC50<100±n/a nM
EC50<10000±n/a nM
Commentsextracted
Citation Zeng, QToro, APatterson, JBWade, WSZubovics, ZYang, YWu, Z IRE-1α inhibitors US Patent US9693992 Publication Date 7/4/2017
 
Serine/threonine-protein kinase/endoribonuclease IRE1
Name:Serine/threonine-protein kinase/endoribonuclease IRE1
Type:Enzyme
Mol. Mass.:109731.20
Organism:Homo sapiens (Human)
Description:O75460
Residue:977
BDBM160356
NameBDBM160356
Synonyms:US9040714, 24 | US9693992, 24
TypeSmall organic molecule
Emp. Form.C22H21FN2O4
Mol. Mass.396.4115
SMILESCN1CCN(CC1)c1ccc(cc1)-c1c(C)c2cc(F)c(O)c(C=O)c2oc1=O