Reaction Details
TargetD(2) dopamine receptor
LigandBDBM21378
Substrate/CompetitorBDBM21397
Meas. Tech.Radioligand Labeled Binding Assay
Ki 173±n/a nM
Citation Leopoldo, MLacivita, EContino, MColabufo, NABerardi, FPerrone, R Structure-activity relationship study on N-(1,2,3,4-tetrahydronaphthalen-1-yl)-4-aryl-1-piperazinehexanamides, a class of 5-HT7 receptor agents. 2. J Med Chem50:4214-21 (2007) 
 
D(2) dopamine receptor
Name:D(2) dopamine receptor
Type:Cell-surface receptors
Mol. Mass.:50647.10
Organism:Homo sapiens (Human)
Description:P14416
Residue:443
BDBM21378
BDBM21397
NameBDBM21378
Synonyms:6-[4-(2-ethylphenyl)piperazin-1-yl]-N-(1,2,3,4-tetrahydronaphthalen-1-yl)hexanamide | Piperazinehexanamide derivative, 16
TypeSmall organic molecule
Emp. Form.C28H39N3O
Mol. Mass.433.6288
SMILESCCc1ccccc1N1CCN(CCCCCC(=O)NC2CCCc3ccccc23)CC1